Reaction Details
TargetCalcium-dependent protein kinase 1
LigandBDBM36336
Substrate/Competitorn/a
Meas. Tech.ChEMBL_2194680 (CHEMBL5107040)
IC50 2.1±n/a nM
Citation Galal, KATruong, AKwarcinski, Fde Silva, CAvalani, KHavener, TMChirgwin, MEMerten, EOng, HWWillis, CAbdelwaly, AHelal, MADerbyshire, ERZutshi, RDrewry, DH Identification of Novel 2,4,5-Trisubstituted Pyrimidines as Potent Dual Inhibitors of Plasmodial  J Med Chem65:13172-13197 (2022) 
 
Calcium-dependent protein kinase 1
Name:Calcium-dependent protein kinase 1
Type:PROTEIN
Mol. Mass.:60804.87
Organism:Plasmodium Falciparum
Description:P62343
Residue:524
BDBM36336
NameBDBM36336
Synonyms:CID24762166 | Purfalcamine, 1
TypeSmall organic molecule
Emp. Form.C29H33FN8O
Mol. Mass.528.6237
SMILESN[C@H]1CC[C@@H](CC1)Nc1nc(Nc2ccc(cc2)C(=O)N2CCCCC2)c2ncn(-c3cccc(F)c3)c2n1