Reaction Details
TargetMelatonin receptor type 1B
LigandBDBM50161381
Substrate/Competitorn/a
Meas. Tech.ChEMBL_303518 (CHEMBL839632)
Ki 5±n/a nM
Citation Sun, LQTakaki, KChen, JBertenshaw, SIben, LMahle, CDRyan, EWu, DGao, QXu, C (R)-2-(4-Phenylbutyl)dihydrobenzofuran derivatives as melatoninergic agents. Bioorg Med Chem Lett15:1345-9 (2005) 
 
Melatonin receptor type 1B
Name:Melatonin receptor type 1B
Type:Enzyme
Mol. Mass.:40203.54
Organism:Homo sapiens (Human)
Description:P49286
Residue:362
BDBM50161381
NameBDBM50161381
Synonyms:CHEMBL361410 | Cyclopropanecarboxylic acid {(1R,2R)-2-[(R)-2-(4-phenyl-butyl)-2,3-dihydro-benzofuran-4-yl]-cyclopropylmethyl}-amide
TypeSmall organic molecule
Emp. Form.C26H31NO2
Mol. Mass.389.5298
SMILESO=C(NC[C@@H]1C[C@H]1c1cccc2O[C@H](CCCCc3ccccc3)Cc12)C1CC1