Reaction Details
TargetMelatonin receptor type 1A
LigandBDBM50161384
Substrate/Competitorn/a
Meas. Tech.ChEMBL_303517 (CHEMBL839631)
Ki 4±n/a nM
Citation Sun, LQTakaki, KChen, JBertenshaw, SIben, LMahle, CDRyan, EWu, DGao, QXu, C (R)-2-(4-Phenylbutyl)dihydrobenzofuran derivatives as melatoninergic agents. Bioorg Med Chem Lett15:1345-9 (2005) 
 
Melatonin receptor type 1A
Name:Melatonin receptor type 1A
Type:Enzyme
Mol. Mass.:39392.94
Organism:Homo sapiens (Human)
Description:P48039
Residue:350
BDBM50161384
NameBDBM50161384
Synonyms:CHEMBL181687 | N-{3-[(R)-2-(4-Phenyl-butyl)-2,3-dihydro-benzofuran-4-yl]-propyl}-isobutyramide
TypeSmall organic molecule
Emp. Form.C25H33NO2
Mol. Mass.379.535
SMILESCC(C)C(=O)NCCCc1cccc2O[C@H](CCCCc3ccccc3)Cc12