Reaction Details
TargetMelatonin receptor type 1A
LigandBDBM50161387
Substrate/Competitorn/a
Meas. Tech.ChEMBL_303517 (CHEMBL839631)
Ki 1±n/a nM
Citation Sun, LQTakaki, KChen, JBertenshaw, SIben, LMahle, CDRyan, EWu, DGao, QXu, C (R)-2-(4-Phenylbutyl)dihydrobenzofuran derivatives as melatoninergic agents. Bioorg Med Chem Lett15:1345-9 (2005) 
 
Melatonin receptor type 1A
Name:Melatonin receptor type 1A
Type:Enzyme
Mol. Mass.:39392.94
Organism:Homo sapiens (Human)
Description:P48039
Residue:350
BDBM50161387
NameBDBM50161387
Synonyms:CHEMBL178678 | N-{3-[(R)-2-(4-Phenyl-butyl)-2,3-dihydro-benzofuran-4-yl]-propyl}-propionamide
TypeSmall organic molecule
Emp. Form.C24H31NO2
Mol. Mass.365.5084
SMILESCCC(=O)NCCCc1cccc2O[C@H](CCCCc3ccccc3)Cc12