Reaction Details
TargetLiver carboxylesterase 1
LigandBDBM50161522
Substrate/Competitorn/a
Meas. Tech.ChEMBL_305902 (CHEMBL832566)
IC50 30±n/a nM
Citation Leung, DDu, WHardouin, CCheng, HHwang, ICravatt, BFBoger, DL Discovery of an exceptionally potent and selective class of fatty acid amide hydrolase inhibitors enlisting proteome-wide selectivity screening: concurrent optimization of enzyme inhibitor potency and selectivity. Bioorg Med Chem Lett15:1423-8 (2005) 
 
Liver carboxylesterase 1
Name:Liver carboxylesterase 1
Type:Protein
Mol. Mass.:62520.83
Organism:Homo sapiens (Human)
Description:n/a
Residue:567
BDBM50161522
NameBDBM50161522
Synonyms:6-Phenyl-1-(5-pyridin-2-yl-[1,3,4]oxadiazol-2-yl)-hexan-1-one | CHEMBL424976
TypeSmall organic molecule
Emp. Form.C19H19N3O2
Mol. Mass.321.3731
SMILESO=C(CCCCCc1ccccc1)c1nnc(o1)-c1ccccn1