Reaction Details
TargetFatty-acid amide hydrolase 1
LigandBDBM50100865
Substrate/Competitorn/a
Meas. Tech.ChEMBL_303730 (CHEMBL829636)
Ki 2.3±n/a nM
Citation Leung, DDu, WHardouin, CCheng, HHwang, ICravatt, BFBoger, DL Discovery of an exceptionally potent and selective class of fatty acid amide hydrolase inhibitors enlisting proteome-wide selectivity screening: concurrent optimization of enzyme inhibitor potency and selectivity. Bioorg Med Chem Lett15:1423-8 (2005) 
 
Fatty-acid amide hydrolase 1
Name:Fatty-acid amide hydrolase 1
Type:Hydrolase; single-pass membrane protein; homodimer
Mol. Mass.:63227.28
Organism:Mus musculus (mouse)
Description:Mouse brain membranes were used in the assay.
Residue:579
BDBM50100865
NameBDBM50100865
Synonyms:(Z)-1-(oxazolo[4,5-b]pyridin-2-yl)octadec-9-en-1-one 1-Oxazolo[4,5-b]pyridin-2-yl-nonadec-10-en-2-one | CHEMBL35925
TypeSmall organic molecule
Emp. Form.C24H36N2O2
Mol. Mass.384.5548
SMILESCCCCCCCC\C=C/CCCCCCCC(=O)c1nc2ncccc2o1