Reaction Details
TargetEstrogen receptor beta
LigandBDBM50161702
Substrate/Competitorn/a
Meas. Tech.ChEMBL_305295 (CHEMBL832843)
IC50 20.09±n/a nM
Citation Yang, CXu, GLi, JWu, XLiu, BYan, XWang, MXie, Y Benzothiophenes containing a piperazine side chain as selective ligands for the estrogen receptor alpha and their bioactivities in vivo. Bioorg Med Chem Lett15:1505-7 (2005) 
 
Estrogen receptor beta
Name:Estrogen receptor beta
Type:Protein
Mol. Mass.:59238.43
Organism:Homo sapiens (Human)
Description:Q92731
Residue:530
BDBM50161702
NameBDBM50161702
Synonyms:CHEMBL178857 | Furan-2-yl-(4-{4-[6-hydroxy-2-(4-hydroxy-phenyl)-benzo[b]thiophene-3-carbonyl]-phenyl}-piperazin-1-yl)-methanone
TypeSmall organic molecule
Emp. Form.C30H24N2O5S
Mol. Mass.524.587
SMILESOc1ccc(cc1)-c1sc2cc(O)ccc2c1C(=O)c1ccc(cc1)N1CCN(CC1)C(=O)c1ccco1