Reaction Details
TargetEstrogen receptor beta
LigandBDBM50161703
Substrate/Competitorn/a
Meas. Tech.ChEMBL_305295 (CHEMBL832843)
IC50 3.21±n/a nM
Citation Yang, CXu, GLi, JWu, XLiu, BYan, XWang, MXie, Y Benzothiophenes containing a piperazine side chain as selective ligands for the estrogen receptor alpha and their bioactivities in vivo. Bioorg Med Chem Lett15:1505-7 (2005) 
 
Estrogen receptor beta
Name:Estrogen receptor beta
Type:Protein
Mol. Mass.:59238.43
Organism:Homo sapiens (Human)
Description:Q92731
Residue:530
BDBM50161703
NameBDBM50161703
Synonyms:(2-Chloro-phenyl)-(4-{4-[6-hydroxy-2-(4-hydroxy-phenyl)-benzo[b]thiophene-3-carbonyl]-phenyl}-piperazin-1-yl)-methanone | CHEMBL180973
TypeSmall organic molecule
Emp. Form.C32H25ClN2O4S
Mol. Mass.569.07
SMILESOc1ccc(cc1)-c1sc2cc(O)ccc2c1C(=O)c1ccc(cc1)N1CCN(CC1)C(=O)c1ccccc1Cl