Reaction Details
TargetEstrogen receptor beta
LigandBDBM50161705
Substrate/Competitorn/a
Meas. Tech.ChEMBL_305295 (CHEMBL832843)
IC50 9.07±n/a nM
Citation Yang, CXu, GLi, JWu, XLiu, BYan, XWang, MXie, Y Benzothiophenes containing a piperazine side chain as selective ligands for the estrogen receptor alpha and their bioactivities in vivo. Bioorg Med Chem Lett15:1505-7 (2005) 
 
Estrogen receptor beta
Name:Estrogen receptor beta
Type:Protein
Mol. Mass.:59238.43
Organism:Homo sapiens (Human)
Description:Q92731
Residue:530
BDBM50161705
NameBDBM50161705
Synonyms:CHEMBL178679 | {4-[4-(4-Chloro-phenyl)-piperazin-1-yl]-phenyl}-[6-hydroxy-2-(4-hydroxy-phenyl)-benzo[b]thiophen-3-yl]-methanone
TypeSmall organic molecule
Emp. Form.C31H25ClN2O3S
Mol. Mass.541.06
SMILESOc1ccc(cc1)-c1sc2cc(O)ccc2c1C(=O)c1ccc(cc1)N1CCN(CC1)c1ccc(Cl)cc1