Reaction Details
TargetEstrogen receptor
LigandBDBM50161713
Substrate/Competitorn/a
Meas. Tech.ChEMBL_305325 (CHEMBL833547)
IC50 2.15±n/a nM
Citation Yang, CXu, GLi, JWu, XLiu, BYan, XWang, MXie, Y Benzothiophenes containing a piperazine side chain as selective ligands for the estrogen receptor alpha and their bioactivities in vivo. Bioorg Med Chem Lett15:1505-7 (2005) 
 
Estrogen receptor
Name:Estrogen receptor
Type:Protein
Mol. Mass.:66230.44
Organism:Homo sapiens (Human)
Description:P03372
Residue:595
BDBM50161713
NameBDBM50161713
Synonyms:(4-{4-[6-Hydroxy-2-(4-hydroxy-phenyl)-benzo[b]thiophene-3-carbonyl]-phenyl}-piperazin-1-yl)-(4-nitro-phenyl)-methanone | CHEMBL362020
TypeSmall organic molecule
Emp. Form.C32H25N3O6S
Mol. Mass.579.622
SMILESOc1ccc(cc1)-c1sc2cc(O)ccc2c1C(=O)c1ccc(cc1)N1CCN(CC1)C(=O)c1ccc(cc1)[N+]([O-])=O