Reaction Details
TargetEstrogen receptor
LigandBDBM50161704
Substrate/Competitorn/a
Meas. Tech.ChEMBL_305325 (CHEMBL833547)
IC50 2.74±n/a nM
Citation Yang, CXu, GLi, JWu, XLiu, BYan, XWang, MXie, Y Benzothiophenes containing a piperazine side chain as selective ligands for the estrogen receptor alpha and their bioactivities in vivo. Bioorg Med Chem Lett15:1505-7 (2005) 
 
Estrogen receptor
Name:Estrogen receptor
Type:Protein
Mol. Mass.:66230.44
Organism:Homo sapiens (Human)
Description:P03372
Residue:595
BDBM50161704
NameBDBM50161704
Synonyms:(4-{4-[6-Hydroxy-2-(4-hydroxy-phenyl)-benzo[b]thiophene-3-carbonyl]-phenyl}-piperazin-1-yl)-p-tolyl-methanone | CHEMBL180702
TypeSmall organic molecule
Emp. Form.C33H28N2O4S
Mol. Mass.548.651
SMILESCc1ccc(cc1)C(=O)N1CCN(CC1)c1ccc(cc1)C(=O)c1c(sc2cc(O)ccc12)-c1ccc(O)cc1