Reaction Details
TargetRNA-directed RNA polymerase
LigandBDBM50162094
Substrate/Competitorn/a
Meas. Tech.ChEMBL_304334 (CHEMBL839761)
EC50 6.7±n/a nM
Citation Harper, SPacini, BAvolio, SDi Filippo, MMigliaccio, GLaufer, RDe Francesco, RRowley, MNarjes, F Development and preliminary optimization of indole-N-acetamide inhibitors of hepatitis C virus NS5B polymerase. J Med Chem48:1314-7 (2005) 
 
RNA-directed RNA polymerase
Name:RNA-directed RNA polymerase
Type:Protein
Mol. Mass.:25173.95
Organism:Hepatitis C virus
Description:Q8JXU8
Residue:229
BDBM50162094
NameBDBM50162094
Synonyms:3-Cyclohexyl-2-phenyl-1H-indole-6-carboxylic acid | CHEMBL368884
TypeSmall organic molecule
Emp. Form.C21H21NO2
Mol. Mass.319.3969
SMILESOC(=O)c1ccc2c(C3CCCCC3)c([nH]c2c1)-c1ccccc1