Reaction Details
TargetVascular endothelial growth factor receptor 2
LigandBDBM50162145
Substrate/Competitorn/a
Meas. Tech.ChEMBL_305183 (CHEMBL876146)
IC50<1±n/a nM
Citation Kubo, KShimizu, TOhyama, SMurooka, HIwai, ANakamura, KHasegawa, KKobayashi, YTakahashi, NTakahashi, KKato, SIzawa, TIsoe, T Novel potent orally active selective VEGFR-2 tyrosine kinase inhibitors: synthesis, structure-activity relationships, and antitumor activities of N-phenyl-N'-{4-(4-quinolyloxy)phenyl}ureas. J Med Chem48:1359-66 (2005) 
 
Vascular endothelial growth factor receptor 2
Name:Vascular endothelial growth factor receptor 2
Type:Receptor Tyrosine Kinase
Mol. Mass.:151510.97
Organism:Homo sapiens (Human)
Description:P35968
Residue:1356
BDBM50162145
NameBDBM50162145
Synonyms:1-[4-(6,7-Dimethoxy-quinolin-4-yloxy)-phenyl]-3-(3-methoxy-phenyl)-urea | CHEMBL178156
TypeSmall organic molecule
Emp. Form.C25H23N3O5
Mol. Mass.445.4672
SMILESCOc1cccc(NC(=O)Nc2ccc(Oc3ccnc4cc(OC)c(OC)cc34)cc2)c1