Reaction Details
TargetPlatelet-derived growth factor receptor alpha
LigandBDBM50162156
Substrate/Competitorn/a
Meas. Tech.ChEMBL_305182 (CHEMBL832771)
IC50 1.6±n/a nM
Citation Kubo, KShimizu, TOhyama, SMurooka, HIwai, ANakamura, KHasegawa, KKobayashi, YTakahashi, NTakahashi, KKato, SIzawa, TIsoe, T Novel potent orally active selective VEGFR-2 tyrosine kinase inhibitors: synthesis, structure-activity relationships, and antitumor activities of N-phenyl-N'-{4-(4-quinolyloxy)phenyl}ureas. J Med Chem48:1359-66 (2005) 
 
Platelet-derived growth factor receptor alpha
Name:Platelet-derived growth factor receptor alpha
Type:Protein
Mol. Mass.:122633.38
Organism:Homo sapiens (Human)
Description:P16234
Residue:1089
BDBM50162156
NameBDBM50162156
Synonyms:1-(2,3-Difluoro-phenyl)-3-[4-(6,7-dimethoxy-quinolin-4-yloxy)-phenyl]-urea | CHEMBL179698
TypeSmall organic molecule
Emp. Form.C24H19F2N3O4
Mol. Mass.451.4222
SMILESCOc1cc2nccc(Oc3ccc(NC(=O)Nc4cccc(F)c4F)cc3)c2cc1OC