Reaction Details
TargetExtracellular calcium-sensing receptor
LigandBDBM50162539
Substrate/Competitorn/a
Meas. Tech.ChEMBL_305795 (CHEMBL827983)
IC50 520±n/a nM
Citation Shcherbakova, IBalandrin, MFFox, JGhatak, AHeaton, WLConklin, RL 3H-Quinazolin-4-ones as a new calcilytic template for the potential treatment of osteoporosis. Bioorg Med Chem Lett15:1557-60 (2005) 
 
Extracellular calcium-sensing receptor
Name:Extracellular calcium-sensing receptor
Type:Protein
Mol. Mass.:120663.13
Organism:Homo sapiens (Human)
Description:P41180
Residue:1078
BDBM50162539
NameBDBM50162539
Synonyms:3-[2-(3-Fluoro-phenyl)-ethyl]-2-(2-hydroxy-phenyl)-6-methyl-3H-quinazolin-4-one | CHEMBL180057
TypeSmall organic molecule
Emp. Form.C23H19FN2O2
Mol. Mass.374.4076
SMILESCc1ccc2nc(-c3ccccc3O)n(CCc3cccc(F)c3)c(=O)c2c1