Reaction Details
TargetExtracellular calcium-sensing receptor
LigandBDBM50162538
Substrate/Competitorn/a
Meas. Tech.ChEMBL_305795 (CHEMBL827983)
IC50 250±n/a nM
Citation Shcherbakova, IBalandrin, MFFox, JGhatak, AHeaton, WLConklin, RL 3H-Quinazolin-4-ones as a new calcilytic template for the potential treatment of osteoporosis. Bioorg Med Chem Lett15:1557-60 (2005) 
 
Extracellular calcium-sensing receptor
Name:Extracellular calcium-sensing receptor
Type:Protein
Mol. Mass.:120663.13
Organism:Homo sapiens (Human)
Description:P41180
Residue:1078
BDBM50162538
NameBDBM50162538
Synonyms:2-(2-Hydroxy-phenyl)-5-methyl-3-phenethyl-3H-quinazolin-4-one | CHEMBL361623
TypeSmall organic molecule
Emp. Form.C23H20N2O2
Mol. Mass.356.4171
SMILESCc1cccc2nc(-c3ccccc3O)n(CCc3ccccc3)c(=O)c12