Reaction Details
TargetCytochrome P450 3A4
LigandBDBM50162778
Substrate/Competitorn/a
Meas. Tech.ChEMBL_305432 (CHEMBL830925)
IC50 220±n/a nM
Citation Mulvihill, MJKan, JLBeck, PBittner, MCesario, CCooke, AKeane, DMNigro, AINillson, CSmith, VSrebernak, MSun, FLVrkljan, MWinski, SLCastelhano, ALEmerson, DGibson, N Potent and selective [2-imidazol-1-yl-2-(6-alkoxy-naphthalen-2-yl)-1-methyl-ethyl]-dimethyl-amines as retinoic acid metabolic blocking agents (RAMBAs). Bioorg Med Chem Lett15:1669-73 (2005) 
 
Cytochrome P450 3A4
Name:Cytochrome P450 3A4
Type:Enzyme
Mol. Mass.:57349.57
Organism:Homo sapiens (Human)
Description:n/a
Residue:503
BDBM50162778
NameBDBM50162778
Synonyms:CHEMBL362412 | {4-[6-(2-Dimethylamino-1-imidazol-1-yl-propyl)-naphthalen-2-yloxymethyl]-phenoxy}-acetic acid methyl ester
TypeSmall organic molecule
Emp. Form.C28H31N3O4
Mol. Mass.473.5634
SMILESCOC(=O)COc1ccc(COc2ccc3cc(ccc3c2)C(C(C)N(C)C)n2ccnc2)cc1