Reaction Details
TargetCytochrome P450 26A1
LigandBDBM50162793
Substrate/Competitorn/a
Meas. Tech.ChEMBL_305304 (CHEMBL832851)
IC50 16.0±n/a nM
Citation Mulvihill, MJKan, JLBeck, PBittner, MCesario, CCooke, AKeane, DMNigro, AINillson, CSmith, VSrebernak, MSun, FLVrkljan, MWinski, SLCastelhano, ALEmerson, DGibson, N Potent and selective [2-imidazol-1-yl-2-(6-alkoxy-naphthalen-2-yl)-1-methyl-ethyl]-dimethyl-amines as retinoic acid metabolic blocking agents (RAMBAs). Bioorg Med Chem Lett15:1669-73 (2005) 
 
Cytochrome P450 26A1
Name:Cytochrome P450 26A1
Type:Enzyme
Mol. Mass.:56216.16
Organism:Homo sapiens (Human)
Description:O43174
Residue:497
BDBM50162793
NameBDBM50162793
Synonyms:4-[6-(2-Dimethylamino-1-imidazol-1-yl-propyl)-naphthalen-2-yloxymethyl]-benzoic acid methyl ester | CHEMBL178474
TypeSmall organic molecule
Emp. Form.C27H29N3O3
Mol. Mass.443.5375
SMILESCOC(=O)c1ccc(COc2ccc3cc(ccc3c2)C(C(C)N(C)C)n2ccnc2)cc1