Reaction Details
TargetCytochrome P450 3A4
LigandBDBM50162782
Substrate/Competitorn/a
Meas. Tech.ChEMBL_305432 (CHEMBL830925)
IC50 750±n/a nM
Citation Mulvihill, MJKan, JLBeck, PBittner, MCesario, CCooke, AKeane, DMNigro, AINillson, CSmith, VSrebernak, MSun, FLVrkljan, MWinski, SLCastelhano, ALEmerson, DGibson, N Potent and selective [2-imidazol-1-yl-2-(6-alkoxy-naphthalen-2-yl)-1-methyl-ethyl]-dimethyl-amines as retinoic acid metabolic blocking agents (RAMBAs). Bioorg Med Chem Lett15:1669-73 (2005) 
 
Cytochrome P450 3A4
Name:Cytochrome P450 3A4
Type:Enzyme
Mol. Mass.:57349.57
Organism:Homo sapiens (Human)
Description:n/a
Residue:503
BDBM50162782
NameBDBM50162782
Synonyms:CHEMBL179550 | {4-[6-(2-Dimethylamino-1-imidazol-1-yl-propyl)-naphthalen-2-yloxymethyl]-phenoxy}-acetic acid
TypeSmall organic molecule
Emp. Form.C27H29N3O4
Mol. Mass.459.5369
SMILESCC(C(c1ccc2cc(OCc3ccc(OCC(O)=O)cc3)ccc2c1)n1ccnc1)N(C)C