Reaction Details
TargetFatty-acid amide hydrolase 1
LigandBDBM23120
Substrate/Competitorn/a
Meas. Tech.ChEMBL_303610 (CHEMBL829699)
Ki 9.0±n/a nM
Citation Boger, DLMiyauchi, HDu, WHardouin, CFecik, RACheng, HHwang, IHedrick, MPLeung, DAcevedo, OGuimarães, CRJorgensen, WLCravatt, BF Discovery of a potent, selective, and efficacious class of reversible alpha-ketoheterocycle inhibitors of fatty acid amide hydrolase effective as analgesics. J Med Chem48:1849-56 (2005) 
 
Fatty-acid amide hydrolase 1
Name:Fatty-acid amide hydrolase 1
Type:Protein
Mol. Mass.:63071.19
Organism:Homo sapiens (Human)
Description:O00519
Residue:579
BDBM23120
NameBDBM23120
Synonyms:7-phenyl-1-[5-(pyridin-2-yl)-1,3-oxazol-2-yl]heptan-1-one OL-135
TypeSmall organic molecule
Emp. Form.C21H22N2O2
Mol. Mass.334.4116
SMILESO=C(CCCCCCc1ccccc1)c1ncc(o1)-c1ccccn1