Reaction Details
TargetC-C chemokine receptor type 3
LigandBDBM50117461
Substrate/Competitorn/a
Meas. Tech.ChEMBL_306872 (CHEMBL828678)
IC50 30±n/a nM
Citation De Lucca, GVKim, UTVargo, BJDuncia, JVSantella, JBGardner, DSZheng, CLiauw, AWang, ZEmmett, GWacker, DAWelch, PKCovington, MStowell, NCWadman, EADas, AMDavies, PYeleswaram, SGraden, DMSolomon, KANewton, RCTrainor, GLDecicco, CPKo, SS Discovery of CC chemokine receptor-3 (CCR3) antagonists with picomolar potency. J Med Chem48:2194-211 (2005) 
 
C-C chemokine receptor type 3
Name:C-C chemokine receptor type 3
Type:Enzyme
Mol. Mass.:41053.88
Organism:Homo sapiens (Human)
Description:P51677
Residue:355
BDBM50117461
NameBDBM50117461
Synonyms:3-[3-(3-Acetyl-phenyl)-ureido]-2-[4-(4-fluoro-benzyl)-piperidin-1-ylmethyl]-N-methyl-benzamide | CHEMBL123611
TypeSmall organic molecule
Emp. Form.C30H33FN4O3
Mol. Mass.516.6064
SMILESCNC(=O)c1cccc(NC(=O)Nc2cccc(c2)C(C)=O)c1CN1CCC(Cc2ccc(F)cc2)CC1