Reaction Details
TargetC-C chemokine receptor type 3
LigandBDBM50163647
Substrate/Competitorn/a
Meas. Tech.ChEMBL_306872 (CHEMBL828678)
IC50 1.8±n/a nM
Citation De Lucca, GVKim, UTVargo, BJDuncia, JVSantella, JBGardner, DSZheng, CLiauw, AWang, ZEmmett, GWacker, DAWelch, PKCovington, MStowell, NCWadman, EADas, AMDavies, PYeleswaram, SGraden, DMSolomon, KANewton, RCTrainor, GLDecicco, CPKo, SS Discovery of CC chemokine receptor-3 (CCR3) antagonists with picomolar potency. J Med Chem48:2194-211 (2005) 
 
C-C chemokine receptor type 3
Name:C-C chemokine receptor type 3
Type:Enzyme
Mol. Mass.:41053.88
Organism:Homo sapiens (Human)
Description:P51677
Residue:355
BDBM50163647
NameBDBM50163647
Synonyms:1-(2,3-Dimethyl-3a,7a-dihydro-1H-indol-6-yl)-3-{(1R,2S)-2-[(S)-3-(4-fluoro-benzyl)-piperidin-1-ylmethyl]-cyclohexyl}-urea | CHEMBL365176
TypeSmall organic molecule
Emp. Form.C30H41FN4O
Mol. Mass.492.6711
SMILESCC1C2C=CC(NC(=O)N[C@@H]3CCCC[C@H]3CN3CCC[C@@H](Cc4ccc(F)cc4)C3)=CC2N=C1C