Reaction Details
TargetC-C chemokine receptor type 3
LigandBDBM50163658
Substrate/Competitorn/a
Meas. Tech.ChEMBL_306872 (CHEMBL828678)
IC50 12±n/a nM
Citation De Lucca, GVKim, UTVargo, BJDuncia, JVSantella, JBGardner, DSZheng, CLiauw, AWang, ZEmmett, GWacker, DAWelch, PKCovington, MStowell, NCWadman, EADas, AMDavies, PYeleswaram, SGraden, DMSolomon, KANewton, RCTrainor, GLDecicco, CPKo, SS Discovery of CC chemokine receptor-3 (CCR3) antagonists with picomolar potency. J Med Chem48:2194-211 (2005) 
 
C-C chemokine receptor type 3
Name:C-C chemokine receptor type 3
Type:Enzyme
Mol. Mass.:41053.88
Organism:Homo sapiens (Human)
Description:P51677
Residue:355
BDBM50163658
NameBDBM50163658
Synonyms:1-(3-Cyano-phenyl)-3-{(1R,2S)-2-[4-(4-fluoro-benzyl)-piperidin-1-ylmethyl]-cyclohexyl}-urea | CHEMBL362465
TypeSmall organic molecule
Emp. Form.C27H33FN4O
Mol. Mass.448.5755
SMILESFc1ccc(CC2CCN(C[C@@H]3CCCC[C@H]3NC(=O)Nc3cccc(c3)C#N)CC2)cc1