Reaction Details
TargetLIM domain kinase 2
LigandBDBM50390791
Substrate/Competitorn/a
Meas. Tech.ChEMBL_2199835 (CHEMBL5112351)
IC50 708±n/a nM
Citation Collins, RLee, HJones, DHElkins, JMGillespie, JAThomas, CBaldwin, AGJones, KWaters, LPaine, MAtack, JRWard, SEGrubisha, OFoley, DW Comparative Analysis of Small-Molecule LIMK1/2 Inhibitors: Chemical Synthesis, Biochemistry, and Cellular Activity. J Med Chem65:13705-13713 (2022) 
 
LIM domain kinase 2
Name:LIM domain kinase 2
Type:PROTEIN
Mol. Mass.:72238.81
Organism:Homo sapiens (Human)
Description:ChEMBL_1514398
Residue:638
BDBM50390791
NameBDBM50390791
Synonyms:CHEMBL2070615
TypeSmall organic molecule
Emp. Form.C23H23N7O2S
Mol. Mass.461.539
SMILESCCNC(=O)Nc1ncc(s1)-c1cc(nc(n1)-c1cnccn1)-c1c(C)cc(OC)cc1C