Reaction Details
TargetSodium channel protein type 9 subunit alpha
LigandBDBM50164047
Substrate/Competitorn/a
Meas. Tech.ChEMBL_313003 (CHEMBL874197)
IC50 150±n/a nM
Citation Shao, PPOk, DFisher, MHGarcia, MLKaczorowski, GJLi, CLyons, KAMartin, WJMeinke, PTPriest, BTSmith, MMWyvratt, MJYe, FParsons, WH Novel cyclopentane dicarboxamide sodium channel blockers as a potential treatment for chronic pain. Bioorg Med Chem Lett15:1901-7 (2005) 
 
Sodium channel protein type 9 subunit alpha
Name:Sodium channel protein type 9 subunit alpha
Type:Protein
Mol. Mass.:226375.97
Organism:Homo sapiens (Human)
Description:Q15858
Residue:1988
BDBM50164047
NameBDBM50164047
Synonyms:CHEMBL361097 N-[2,2']bithiophenyl-5-ylmethyl-N'-(2'-sulfamoyl-biphenyl-4-ylmethyl)-succinamide
TypeSmall organic molecule
Emp. Form.C26H25N3O4S3
Mol. Mass.539.689
SMILESNS(=O)(=O)c1ccccc1-c1ccc(CNC(=O)CCC(=O)NCc2ccc(s2)-c2cccs2)cc1