Reaction Details
TargetSodium channel protein type 9 subunit alpha
LigandBDBM50164073
Substrate/Competitorn/a
Meas. Tech.ChEMBL_313003 (CHEMBL874197)
IC50 1100±n/a nM
Citation Shao, PPOk, DFisher, MHGarcia, MLKaczorowski, GJLi, CLyons, KAMartin, WJMeinke, PTPriest, BTSmith, MMWyvratt, MJYe, FParsons, WH Novel cyclopentane dicarboxamide sodium channel blockers as a potential treatment for chronic pain. Bioorg Med Chem Lett15:1901-7 (2005) 
 
Sodium channel protein type 9 subunit alpha
Name:Sodium channel protein type 9 subunit alpha
Type:Protein
Mol. Mass.:226375.97
Organism:Homo sapiens (Human)
Description:Q15858
Residue:1988
BDBM50164073
NameBDBM50164073
Synonyms:(1S,2S)-Cyclopentane-1,2-dicarboxylic acid 1-[(2''-sulfamoyl-biphenyl-4-ylmethyl)-amide] 2-(3-trifluoromethoxy-benzylamide) | CHEMBL182428
TypeSmall organic molecule
Emp. Form.C28H28F3N3O5S
Mol. Mass.575.599
SMILESNS(=O)(=O)c1ccccc1-c1ccc(CNC(=O)[C@H]2CCC[C@@H]2C(=O)NCc2cccc(OC(F)(F)F)c2)cc1