Reaction Details
TargetSodium channel protein type 9 subunit alpha
LigandBDBM50164071
Substrate/Competitorn/a
Meas. Tech.ChEMBL_313003 (CHEMBL874197)
IC50>10000±n/a nM
Citation Shao, PPOk, DFisher, MHGarcia, MLKaczorowski, GJLi, CLyons, KAMartin, WJMeinke, PTPriest, BTSmith, MMWyvratt, MJYe, FParsons, WH Novel cyclopentane dicarboxamide sodium channel blockers as a potential treatment for chronic pain. Bioorg Med Chem Lett15:1901-7 (2005) 
 
Sodium channel protein type 9 subunit alpha
Name:Sodium channel protein type 9 subunit alpha
Type:Protein
Mol. Mass.:226375.97
Organism:Homo sapiens (Human)
Description:Q15858
Residue:1988
BDBM50164071
NameBDBM50164071
Synonyms:(1S,2S)-2-[(Biphenyl-4-ylmethyl)-amino]-cyclopentanecarboxylic acid ([2,2'']bithiophenyl-5-ylmethyl)-amide | CHEMBL360523
TypeSmall organic molecule
Emp. Form.C28H28N2OS2
Mol. Mass.472.665
SMILESO=C(NCc1ccc(s1)-c1cccs1)[C@H]1CCC[C@@H]1NCc1ccc(cc1)-c1ccccc1