Reaction Details
TargetSodium channel protein type 9 subunit alpha
LigandBDBM50164062
Substrate/Competitorn/a
Meas. Tech.ChEMBL_313003 (CHEMBL874197)
IC50 2500±n/a nM
Citation Shao, PPOk, DFisher, MHGarcia, MLKaczorowski, GJLi, CLyons, KAMartin, WJMeinke, PTPriest, BTSmith, MMWyvratt, MJYe, FParsons, WH Novel cyclopentane dicarboxamide sodium channel blockers as a potential treatment for chronic pain. Bioorg Med Chem Lett15:1901-7 (2005) 
 
Sodium channel protein type 9 subunit alpha
Name:Sodium channel protein type 9 subunit alpha
Type:Protein
Mol. Mass.:226375.97
Organism:Homo sapiens (Human)
Description:Q15858
Residue:1988
BDBM50164062
NameBDBM50164062
Synonyms:(1S,2S)-Cyclopentane-1,2-dicarboxylic acid 1-[methyl-(2''-sulfamoyl-biphenyl-4-ylmethyl)-amide] 2-(4-trifluoromethyl-benzylamide) | CHEMBL180542
TypeSmall organic molecule
Emp. Form.C29H30F3N3O4S
Mol. Mass.573.626
SMILESCN(Cc1ccc(cc1)-c1ccccc1S(N)(=O)=O)C(=O)[C@H]1CCC[C@@H]1C(=O)NCc1ccc(cc1)C(F)(F)F