Reaction Details
TargetSodium channel protein type 9 subunit alpha
LigandBDBM50164044
Substrate/Competitorn/a
Meas. Tech.ChEMBL_308686 (CHEMBL834126)
Ki 12000±n/a nM
Citation Shao, PPOk, DFisher, MHGarcia, MLKaczorowski, GJLi, CLyons, KAMartin, WJMeinke, PTPriest, BTSmith, MMWyvratt, MJYe, FParsons, WH Novel cyclopentane dicarboxamide sodium channel blockers as a potential treatment for chronic pain. Bioorg Med Chem Lett15:1901-7 (2005) 
 
Sodium channel protein type 9 subunit alpha
Name:Sodium channel protein type 9 subunit alpha
Type:Protein
Mol. Mass.:226375.97
Organism:Homo sapiens (Human)
Description:Q15858
Residue:1988
BDBM50164044
NameBDBM50164044
Synonyms:(1S,2S)-Cyclopentane-1,2-dicarboxylic acid 1-(4-methoxy-benzylamide) 2-[(2''-sulfamoyl-biphenyl-4-ylmethyl)-amide] | CHEMBL362472
TypeSmall organic molecule
Emp. Form.C28H31N3O5S
Mol. Mass.521.628
SMILESCOc1ccc(CNC(=O)[C@H]2CCC[C@@H]2C(=O)NCc2ccc(cc2)-c2ccccc2S(N)(=O)=O)cc1