Reaction Details
TargetSodium channel protein type 9 subunit alpha
LigandBDBM50164057
Substrate/Competitorn/a
Meas. Tech.ChEMBL_308686 (CHEMBL834126)
Ki 330±n/a nM
Citation Shao, PPOk, DFisher, MHGarcia, MLKaczorowski, GJLi, CLyons, KAMartin, WJMeinke, PTPriest, BTSmith, MMWyvratt, MJYe, FParsons, WH Novel cyclopentane dicarboxamide sodium channel blockers as a potential treatment for chronic pain. Bioorg Med Chem Lett15:1901-7 (2005) 
 
Sodium channel protein type 9 subunit alpha
Name:Sodium channel protein type 9 subunit alpha
Type:Protein
Mol. Mass.:226375.97
Organism:Homo sapiens (Human)
Description:Q15858
Residue:1988
BDBM50164057
NameBDBM50164057
Synonyms:(1S,2S)-2-[Methyl-(2''-trifluoromethyl-biphenyl-4-ylmethyl)-amino]-cyclopentanecarboxylic acid [2,2'']bithiophenyl-5-ylmethyl-methyl-amide | CHEMBL369543
TypeSmall organic molecule
Emp. Form.C31H31F3N2OS2
Mol. Mass.568.716
SMILESCN(Cc1ccc(cc1)-c1ccccc1C(F)(F)F)[C@H]1CCC[C@@H]1C(=O)N(C)Cc1ccc(s1)-c1cccs1