Reaction Details
TargetSodium channel protein type 9 subunit alpha
LigandBDBM50164061
Substrate/Competitorn/a
Meas. Tech.ChEMBL_313003 (CHEMBL874197)
IC50 10000±n/a nM
Citation Shao, PPOk, DFisher, MHGarcia, MLKaczorowski, GJLi, CLyons, KAMartin, WJMeinke, PTPriest, BTSmith, MMWyvratt, MJYe, FParsons, WH Novel cyclopentane dicarboxamide sodium channel blockers as a potential treatment for chronic pain. Bioorg Med Chem Lett15:1901-7 (2005) 
 
Sodium channel protein type 9 subunit alpha
Name:Sodium channel protein type 9 subunit alpha
Type:Protein
Mol. Mass.:226375.97
Organism:Homo sapiens (Human)
Description:Q15858
Residue:1988
BDBM50164061
NameBDBM50164061
Synonyms:(1S,2S)-Cyclopentane-1,2-dicarboxylic acid 1-(4-methoxy-benzylamide) 2-[methyl-(2''-sulfamoyl-biphenyl-4-ylmethyl)-amide] | CHEMBL439847
TypeSmall organic molecule
Emp. Form.C29H33N3O5S
Mol. Mass.535.654
SMILESCOc1ccc(CNC(=O)[C@H]2CCC[C@@H]2C(=O)N(C)Cc2ccc(cc2)-c2ccccc2S(N)(=O)=O)cc1