Reaction Details
TargetSodium channel protein type 9 subunit alpha
LigandBDBM50164045
Substrate/Competitorn/a
Meas. Tech.ChEMBL_308686 (CHEMBL834126)
Ki 370±n/a nM
Citation Shao, PPOk, DFisher, MHGarcia, MLKaczorowski, GJLi, CLyons, KAMartin, WJMeinke, PTPriest, BTSmith, MMWyvratt, MJYe, FParsons, WH Novel cyclopentane dicarboxamide sodium channel blockers as a potential treatment for chronic pain. Bioorg Med Chem Lett15:1901-7 (2005) 
 
Sodium channel protein type 9 subunit alpha
Name:Sodium channel protein type 9 subunit alpha
Type:Protein
Mol. Mass.:226375.97
Organism:Homo sapiens (Human)
Description:Q15858
Residue:1988
BDBM50164045
NameBDBM50164045
Synonyms:(1S,2S)-Cyclopentane-1,2-dicarboxylic acid 1-[(2''-methyl-biphenyl-4-ylmethyl)-amide] 2-[(2''-sulfamoyl-biphenyl-4-ylmethyl)-amide] | CHEMBL361138
TypeSmall organic molecule
Emp. Form.C34H35N3O4S
Mol. Mass.581.724
SMILESCc1ccccc1-c1ccc(CNC(=O)[C@H]2CCC[C@@H]2C(=O)NCc2ccc(cc2)-c2ccccc2S(N)(=O)=O)cc1