Reaction Details
TargetCoagulation factor XIII A chain
LigandBDBM50164220
Substrate/Competitorn/a
Meas. Tech.ChEMBL_304794 (CHEMBL877318)
IC50>100000±n/a nM
Citation Leung-Toung, RTam, TFWodzinska, JMZhao, YLowrie, JSimpson, CDKarimian, KSpino, M 3-Substituted imidazo[1,2-d][1,2,4]-thiadiazoles: a novel class of factor XIIIa inhibitors. J Med Chem48:2266-9 (2005) 
 
Coagulation factor XIII A chain
Name:Coagulation factor XIII A chain
Type:PROTEIN
Mol. Mass.:83261.29
Organism:Homo sapiens (Human)
Description:ChEMBL_1475048
Residue:732
BDBM50164220
NameBDBM50164220
Synonyms:CHEMBL192376 | N-Hexyl-2-nitro-benzenesulfonamide
TypeSmall organic molecule
Emp. Form.C12H18N2O4S
Mol. Mass.286.347
SMILESCCCCCCNS(=O)(=O)c1ccccc1[N+]([O-])=O