Reaction Details
TargetProtein-glutamine gamma-glutamyltransferase K
LigandBDBM50164227
Substrate/Competitorn/a
Meas. Tech.ChEMBL_304809 (CHEMBL827899)
IC50 250±n/a nM
Citation Leung-Toung, RTam, TFWodzinska, JMZhao, YLowrie, JSimpson, CDKarimian, KSpino, M 3-Substituted imidazo[1,2-d][1,2,4]-thiadiazoles: a novel class of factor XIIIa inhibitors. J Med Chem48:2266-9 (2005) 
 
Protein-glutamine gamma-glutamyltransferase K
Name:Protein-glutamine gamma-glutamyltransferase K
Type:Protein
Mol. Mass.:89778.63
Organism:Homo sapiens (Human)
Description:n/a
Residue:817
BDBM50164227
NameBDBM50164227
Synonyms:5-Methyl-2-(2-oxo-propylsulfanyl)-thiazolo[2,3-b][1,3,4]thiadiazol-4-ylium; compound with perchlorate | CHEMBL193220
TypeSmall organic molecule
Emp. Form.C8H9N2OS3
Mol. Mass.245.364
SMILESCC(=O)CSc1n[n+]2c(C)csc2s1