Reaction Details
Target5-hydroxytryptamine receptor 1A
LigandBDBM50143674
Substrate/Competitorn/a
Meas. Tech.ChEMBL_302708 (CHEMBL839580)
Ki 7.5±n/a nM
Citation Konkel, MJWetzel, JMCahir, MCraig, DANoble, SAGluchowski, C Synthesis and structure-activity relationship of fluoro analogues of 8-{2-[4-(4-methoxyphenyl)piperazin-1yl]ethyl}-8-azaspiro[4.5]decane-7,9-dione as selective alpha(1d)-adrenergic receptor antagonists. J Med Chem48:3076-9 (2005) 
 
5-hydroxytryptamine receptor 1A
Name:5-hydroxytryptamine receptor 1A
Type:n/a
Mol. Mass.:46122.49
Organism:Homo sapiens (Human)
Description:n/a
Residue:422
BDBM50143674
NameBDBM50143674
Synonyms:8-{2-[4-(2-Fluoro-phenyl)-piperazin-1-yl]-ethyl}-8-aza-spiro[4.5]decane-7,9-dione | CHEMBL299691
TypeSmall organic molecule
Emp. Form.C21H28FN3O2
Mol. Mass.373.4643
SMILESFc1ccccc1N1CCN(CCN2C(=O)CC3(CCCC3)CC2=O)CC1