Reaction Details
TargetD(2) dopamine receptor
LigandBDBM50026917
Substrate/Competitorn/a
Meas. Tech.ChEMBL_302474 (CHEMBL826339)
Ki 14±n/a nM
Citation Konkel, MJWetzel, JMCahir, MCraig, DANoble, SAGluchowski, C Synthesis and structure-activity relationship of fluoro analogues of 8-{2-[4-(4-methoxyphenyl)piperazin-1yl]ethyl}-8-azaspiro[4.5]decane-7,9-dione as selective alpha(1d)-adrenergic receptor antagonists. J Med Chem48:3076-9 (2005) 
 
D(2) dopamine receptor
Name:D(2) dopamine receptor
Type:Cell-surface receptors
Mol. Mass.:50647.10
Organism:Homo sapiens (Human)
Description:P14416
Residue:443
BDBM50026917
NameBDBM50026917
Synonyms:8-(2-(4-(2-methoxyphenyl)piperazin-1-yl)ethyl)-8-azaspiro[4.5]decane-7,9-dione 8-{2-[4-(2-Methoxy-phenyl)-piperazin-1-yl]-ethyl}-8-aza-spiro[4.5]decane-7,9-dione BMY 7378 CHEMBL1256934 CHEMBL543741
TypeSmall organic molecule
Emp. Form.C22H31N3O3
Mol. Mass.385.4998
SMILESCOc1ccccc1N1CCN(CCN2C(=O)CC3(CCCC3)CC2=O)CC1