Reaction Details
TargetOrexin/Hypocretin receptor type 1
LigandBDBM50592801
Substrate/Competitorn/a
Meas. Tech.ChEMBL_2205644 (CHEMBL5118352)
Ki 3.9±n/a nM
Citation Saitoh, TAmezawa, MHoriuchi, JNagumo, YYamamoto, NKutsumura, NOhshita, RTokuda, AIrukayama-Tomobe, YOgawa, YIshikawa, YHasegawa, ESakurai, TUchida, YSato, TGouda, HTanimura, RYanagisawa, MNagase, H Discovery of novel orexin receptor antagonists using a 1,3,5-trioxazatriquinane bearing multiple effective residues (TriMER) library. Eur J Med Chem240:0 (2022) 
 
Orexin/Hypocretin receptor type 1
Name:Orexin/Hypocretin receptor type 1
Type:Protein
Mol. Mass.:47554.50
Organism:Homo sapiens (Human)
Description:O43613
Residue:425
BDBM50592801
NameBDBM50592801
Synonyms:CHEMBL5173055
TypeSmall organic molecule
Emp. Form.C38H41N5O5
Mol. Mass.647.7626
SMILES[H][C@]12CO[C@]3([H])N1[C@@]([H])(O[C@]3(C)c1cccc(NC(=O)c3ccc(cc3)N(C)C)c1)[C@](C)(O2)c1cccc(NC(=O)c2ccc(cc2)N(C)C)c1