Reaction Details
TargetOrexin/Hypocretin receptor type 1
LigandBDBM50592810
Substrate/Competitorn/a
Meas. Tech.ChEMBL_2205644 (CHEMBL5118352)
Ki 4.0±n/a nM
Citation Saitoh, TAmezawa, MHoriuchi, JNagumo, YYamamoto, NKutsumura, NOhshita, RTokuda, AIrukayama-Tomobe, YOgawa, YIshikawa, YHasegawa, ESakurai, TUchida, YSato, TGouda, HTanimura, RYanagisawa, MNagase, H Discovery of novel orexin receptor antagonists using a 1,3,5-trioxazatriquinane bearing multiple effective residues (TriMER) library. Eur J Med Chem240:0 (2022) 
 
Orexin/Hypocretin receptor type 1
Name:Orexin/Hypocretin receptor type 1
Type:Protein
Mol. Mass.:47554.50
Organism:Homo sapiens (Human)
Description:O43613
Residue:425
BDBM50592810
NameBDBM50592810
Synonyms:CHEMBL5174113
TypeSmall organic molecule
Emp. Form.C36H35N3O7
Mol. Mass.621.679
SMILES[H][C@]12CO[C@]3([H])N1[C@@]([H])(O[C@@]3(C)c1cccc(NC(=O)c3ccc(OC)cc3)c1)[C@@](C)(O2)c1cccc(NC(=O)c2ccc(OC)cc2)c1