Reaction Details
TargetOrexin receptor type 2
LigandBDBM50592793
Substrate/Competitorn/a
Meas. Tech.ChEMBL_2205645 (CHEMBL5118353)
Ki 5.4±n/a nM
Citation Saitoh, TAmezawa, MHoriuchi, JNagumo, YYamamoto, NKutsumura, NOhshita, RTokuda, AIrukayama-Tomobe, YOgawa, YIshikawa, YHasegawa, ESakurai, TUchida, YSato, TGouda, HTanimura, RYanagisawa, MNagase, H Discovery of novel orexin receptor antagonists using a 1,3,5-trioxazatriquinane bearing multiple effective residues (TriMER) library. Eur J Med Chem240:0 (2022) 
 
Orexin receptor type 2
Name:Orexin receptor type 2
Type:Protein
Mol. Mass.:50710.53
Organism:Homo sapiens (Human)
Description:O43614
Residue:444
BDBM50592793
NameBDBM50592793
Synonyms:CHEMBL5193254
TypeSmall organic molecule
Emp. Form.C35H33N3O6
Mol. Mass.591.653
SMILES[H][C@]12CO[C@]3([H])N1[C@@]([H])(O[C@@]3(C)c1cccc(NC(=O)c3cccc(OC)c3)c1)[C@@](C)(O2)c1cccc(NC(=O)c2ccccc2)c1