Reaction Details
TargetCarbonic anhydrase 9
LigandBDBM10860
Substrate/Competitorn/a
Meas. Tech.ChEMBL_302321 (CHEMBL828908)
Ki 103±n/a nM
Citation Puccetti, LFasolis, GCecchi, AWinum, JYGamberi, AMontero, JLScozzafava, ASupuran, CT Carbonic anhydrase inhibitors: synthesis and inhibition of cytosolic/tumor-associated carbonic anhydrase isozymes I, II, and IX with sulfonamides incorporating thioureido-sulfanilyl scaffolds. Bioorg Med Chem Lett15:2359-64 (2005) 
 
Carbonic anhydrase 9
Name:Carbonic anhydrase 9
Type:Enzyme
Mol. Mass.:49669.03
Organism:Homo sapiens (Human)
Description:Catalytic domain of human cloned isozyme was used in the assay
Residue:459
BDBM10860
NameBDBM10860
Synonyms:4-(aminomethyl)benzene-1-sulfonamide MAFENIDE aromatic/heteroaromatic sulfonamide 5 | hCA inhibitor, 9
TypeSmall organic molecule
Emp. Form.C7H10N2O2S
Mol. Mass.186.232
SMILESNCc1ccc(cc1)S(N)(=O)=O