Reaction Details
TargetB1 bradykinin receptor
LigandBDBM50165829
Substrate/Competitorn/a
Meas. Tech.ChEMBL_302988 (CHEMBL830227)
Ki 11±n/a nM
Citation Feng, DMWai, JMKuduk, SDNg, CMurphy, KLRansom, RWReiss, DChang, RSHarrell, CMMacNeil, TTang, CPrueksaritanont, TFreidinger, RMPettibone, DJBock, MG 2,3-Diaminopyridine as a platform for designing structurally unique nonpeptide bradykinin B1 receptor antagonists. Bioorg Med Chem Lett15:2385-8 (2005) 
 
B1 bradykinin receptor
Name:B1 bradykinin receptor
Type:Enzyme
Mol. Mass.:40508.87
Organism:Homo sapiens (Human)
Description:P46663
Residue:353
BDBM50165829
NameBDBM50165829
Synonyms:4'-{[4-Methyl-3-(3,3,3-trifluoro-propionylamino)-pyridin-2-ylamino]-methyl}-biphenyl-2-carboxylic acid methylamide | CHEMBL196494
TypeSmall organic molecule
Emp. Form.C24H23F3N4O2
Mol. Mass.456.4602
SMILESCNC(=O)c1ccccc1-c1ccc(CNc2nccc(C)c2NC(=O)CC(F)(F)F)cc1