Reaction Details
TargetMelanocyte-stimulating hormone receptor
LigandBDBM50165929
Substrate/Competitorn/a
Meas. Tech.ChEMBL_303605 (CHEMBL829694)
Ki 8.2±n/a nM
Citation Mayer, JPHsiung, HMFlora, DBEdwards, PSmith, DPZhang, XYGadski, RAHeiman, MLHertel, JLEmmerson, PJHusain, SO'brien, TPKahl, SDSmiley, DLZhang, LDimarchi, RDYan, LZ Discovery of a beta-MSH-derived MC-4R selective agonist. J Med Chem48:3095-8 (2005) 
 
Melanocyte-stimulating hormone receptor
Name:Melanocyte-stimulating hormone receptor
Type:Enzyme
Mol. Mass.:34717.23
Organism:Homo sapiens (Human)
Description:Q01726
Residue:317
BDBM50165929
NameBDBM50165929
Synonyms:Ac-YR[CEH(pCl-dF)RWC]-NH2 | CHEMBL415661
TypeSmall organic molecule
Emp. Form.C60H78ClN19O13S2
Mol. Mass.1372.964
SMILESCC(=O)N[C@@H](Cc1ccc(O)cc1)C(=O)N[C@@H](CCCNC(N)=N)C(=O)N[C@@H]1CSSC[C@@H](NC(=O)[C@@H](Cc2c[nH]c3ccccc23)NC(=O)[C@H](CCCNC(N)=N)NC(=O)[C@H](Cc2ccc(Cl)cc2)NC(=O)[C@H](Cc2cnc[nH]2)NC(=O)[C@@H](CCC(O)=O)NC1=O)C(N)=O