Reaction Details
TargetMelanocortin receptor 5
LigandBDBM50165940
Substrate/Competitorn/a
Meas. Tech.ChEMBL_303608 (CHEMBL829697)
Ki 62±n/a nM
Citation Mayer, JPHsiung, HMFlora, DBEdwards, PSmith, DPZhang, XYGadski, RAHeiman, MLHertel, JLEmmerson, PJHusain, SO'brien, TPKahl, SDSmiley, DLZhang, LDimarchi, RDYan, LZ Discovery of a beta-MSH-derived MC-4R selective agonist. J Med Chem48:3095-8 (2005) 
 
Melanocortin receptor 5
Name:Melanocortin receptor 5
Type:Enzyme
Mol. Mass.:36612.92
Organism:Homo sapiens (Human)
Description:P33032
Residue:325
BDBM50165940
NameBDBM50165940
Synonyms:Ac-YRC(Me)*EHdFRWC(Me)NH2 | CHEMBL427666
TypeSmall organic molecule
Emp. Form.C62H85N19O13S2
Mol. Mass.1368.588
SMILESCSC[C@H](NC(=O)[C@H](Cc1c[nH]c2ccccc12)NC(=O)[C@H](CCCNC(N)=N)NC(=O)[C@@H](Cc1ccccc1)NC(=O)[C@H](Cc1cnc[nH]1)NC(=O)[C@H](CCC(O)=O)NC(=O)[C@H](CSC)NC(=O)[C@H](CCCNC(N)=N)NC(=O)[C@H](Cc1ccc(O)cc1)NC(C)=O)C(N)=O