Reaction Details
TargetSigma non-opioid intracellular receptor 1
LigandBDBM50593147
Substrate/Competitorn/a
Meas. Tech.ChEMBL_2207448 (CHEMBL5120156)
Ki 24±n/a nM
Citation Turgutalp, BBhattarai, PErcetin, TLuise, CReis, RGurdal, EEIsaak, ABiriken, DDinter, ESipahi, HSchepmann, DJunker, AWünsch, BSippl, WGulcan, HOKizil, CYarim, M Discovery of Potent Cholinesterase Inhibition-Based Multi-Target-Directed Lead Compounds for Synaptoprotection in Alzheimer's Disease. J Med Chem65:12292-12318 (2022) 
 
Sigma non-opioid intracellular receptor 1
Name:Sigma non-opioid intracellular receptor 1
Type:Protein
Mol. Mass.:25307.17
Organism:Cavia porcellus (Guinea pig)
Description:Q60492
Residue:223
BDBM50593147
NameBDBM50593147
Synonyms:CHEMBL5203777
TypeSmall organic molecule
Emp. Form.C21H30N4OS
Mol. Mass.386.554
SMILESCc1cccc2sc(NC(=O)CCN3CCN(CC3)C3CCCCC3)nc12