Reaction Details
TargetMelanocortin receptor 3
LigandBDBM50166533
Substrate/Competitorn/a
Meas. Tech.ChEMBL_303455 (CHEMBL839715)
Ki 450±n/a nM
Citation Pontillo, JTran, JAMarkison, SJoppa, MFleck, BAMarinkovic, DArellano, MTucci, FCLanier, MNelson, JSaunders, JHoare, SRFoster, ACChen, C A potent and selective nonpeptide antagonist of the melanocortin-4 receptor induces food intake in satiated mice. Bioorg Med Chem Lett15:2541-6 (2005) 
 
Melanocortin receptor 3
Name:Melanocortin receptor 3
Type:Enzyme
Mol. Mass.:36044.86
Organism:Homo sapiens (Human)
Description:P41968
Residue:323
BDBM50166533
NameBDBM50166533
Synonyms:1-[(R)-1-(2,4-Dichloro-benzyl)-2-oxo-2-(4-{2-[(2-thiophen-2-yl-ethylamino)-methyl]-phenyl}-piperazin-1-yl)-ethyl]-3-isopropyl-urea | CHEMBL363190
TypeSmall organic molecule
Emp. Form.C30H37Cl2N5O2S
Mol. Mass.602.618
SMILESCC(C)NC(=O)N[C@H](Cc1ccc(Cl)cc1Cl)C(=O)N1CCN(CC1)c1ccccc1CNCCc1cccs1