Reaction Details
TargetCathepsin B
LigandBDBM50167290
Substrate/Competitorn/a
Meas. Tech.ChEMBL_303351 (CHEMBL839666)
Ki 1.3±n/a nM
Citation Barrett, DGDeaton, DNHassell, AMMcFadyen, RBMiller, ABMiller, LRPayne, JAShewchuk, LMWillard, DHWright, LL Acyclic cyanamide-based inhibitors of cathepsin K. Bioorg Med Chem Lett15:3039-43 (2005) 
 
Cathepsin B
Name:Cathepsin B
Type:Enzyme
Mol. Mass.:37819.69
Organism:Homo sapiens (Human)
Description:gi_63102437
Residue:339
BDBM50167290
NameBDBM50167290
Synonyms:(1S)-2-cyclohexyl-1-methylethyl 2-cyano-2-isopropylhydrazinecarboxylate | CHEMBL371420
TypeSmall organic molecule
Emp. Form.C14H25N3O2
Mol. Mass.267.3672
SMILESC[C@@H](CC1CCCCC1)OC(=O)NN(C#N)C(C)C