Reaction Details
TargetCathepsin K
LigandBDBM50167292
Substrate/Competitorn/a
Meas. Tech.ChEMBL_303352 (CHEMBL839667)
Ki 830±n/a nM
Citation Barrett, DGDeaton, DNHassell, AMMcFadyen, RBMiller, ABMiller, LRPayne, JAShewchuk, LMWillard, DHWright, LL Acyclic cyanamide-based inhibitors of cathepsin K. Bioorg Med Chem Lett15:3039-43 (2005) 
 
Cathepsin K
Name:Cathepsin K
Type:Enzyme
Mol. Mass.:36975.68
Organism:Homo sapiens (Human)
Description:P43235
Residue:329
BDBM50167292
NameBDBM50167292
Synonyms:2-(Cyano-methyl-amino)-N-((S)-2-cyclohexyl-1-methyl-ethyl)-acetamide | CHEMBL370529
TypeSmall organic molecule
Emp. Form.C13H23N3O
Mol. Mass.237.3412
SMILESC[C@@H](CC1CCCCC1)NC(=O)CN(C)C#N