Reaction Details
TargetCathepsin K
LigandBDBM50167299
Substrate/Competitorn/a
Meas. Tech.ChEMBL_303352 (CHEMBL839667)
Ki 7900±n/a nM
Citation Barrett, DGDeaton, DNHassell, AMMcFadyen, RBMiller, ABMiller, LRPayne, JAShewchuk, LMWillard, DHWright, LL Acyclic cyanamide-based inhibitors of cathepsin K. Bioorg Med Chem Lett15:3039-43 (2005) 
 
Cathepsin K
Name:Cathepsin K
Type:Enzyme
Mol. Mass.:36975.68
Organism:Homo sapiens (Human)
Description:P43235
Residue:329
BDBM50167299
NameBDBM50167299
Synonyms:CHEMBL191367 | Cyanomethyl-carbamic acid (S)-2-cyclohexyl-1-methyl-ethyl ester
TypeSmall organic molecule
Emp. Form.C12H20N2O2
Mol. Mass.224.2994
SMILESC[C@@H](CC1CCCCC1)OC(=O)NCC#N