Reaction Details
TargetCathepsin K
LigandBDBM50167297
Substrate/Competitorn/a
Meas. Tech.ChEMBL_303352 (CHEMBL839667)
Ki 26±n/a nM
Citation Barrett, DGDeaton, DNHassell, AMMcFadyen, RBMiller, ABMiller, LRPayne, JAShewchuk, LMWillard, DHWright, LL Acyclic cyanamide-based inhibitors of cathepsin K. Bioorg Med Chem Lett15:3039-43 (2005) 
 
Cathepsin K
Name:Cathepsin K
Type:Enzyme
Mol. Mass.:36975.68
Organism:Homo sapiens (Human)
Description:P43235
Residue:329
BDBM50167297
NameBDBM50167297
Synonyms:(Cyano-methyl-amino)-acetic acid (S)-2-cyclohexyl-1-methyl-ethyl ester | CHEMBL189149
TypeSmall organic molecule
Emp. Form.C13H22N2O2
Mol. Mass.238.326
SMILESC[C@@H](CC1CCCCC1)OC(=O)CN(C)C#N