Reaction Details
TargetCarbonic anhydrase 2
LigandBDBM50167367
Substrate/Competitorn/a
Meas. Tech.ChEMBL_308634 (CHEMBL834887)
Ki 48±n/a nM
Citation Winum, JYCecchi, AMontero, JLInnocenti, AScozzafava, ASupuran, CT Carbonic anhydrase inhibitors. Synthesis and inhibition of cytosolic/tumor-associated carbonic anhydrase isozymes I, II, and IX with boron-containing sulfonamides, sulfamides, and sulfamates: toward agents for boron neutron capture therapy of hypoxic tumors. Bioorg Med Chem Lett15:3302-6 (2005) 
 
Carbonic anhydrase 2
Name:Carbonic anhydrase 2
Type:Enzyme
Mol. Mass.:29250.71
Organism:Homo sapiens (Human)
Description:P00918
Residue:260
BDBM50167367
NameBDBM50167367
Synonyms:(4,4,5,5-tetramethyl-1,3,2-dioxaborolan-2-yl)phenylsulfamide N-[4-(4,4,5,5-tetramethyl-1,3,2-dioxaborolan-2-yl)phenyl]aminosulfonamide | N-[4-(4,4,5,5-tetramethyl-1,3,2-dioxaborolan-2-yl)phenyl]sulfamide
TypeSmall organic molecule
Emp. Form.C12H19BN2O4S
Mol. Mass.298.166
SMILESCC1(C)OB(OC1(C)C)c1ccc(NS(N)(=O)=O)cc1